Error Fatal Error During Compilation Org.apache.tools.ant.buildexception

RECOMMENDED: If you have Windows errors then we strongly recommend that you download and run this (Windows) Repair Tool.

Sep 13, 2013. Error Fatal error during compilation org.apache.tools.ant.BuildException: java. lang.OutOfMemoryError: Java heap space (Use –stacktrace to.

I O Error On Dvd Apr 18, 2017  · Error: A required CD/DVD driver device driver is missing – when you starting Windows 7 or Windows Vista from the install DVD. Probably not socks, though if any of them had made that error, it would have been wise to keep the receipt. have been so difficult to elude this woeful circle.

Error Fatal error during compilation org.apache. Error Fatal error during compilation org.apache.tools.ant. org.apache.tools.ant.BuildException:.

Resolving the “Unsupported major.minor version 49.0” Error. fatal error. Hakan says: February 5, org/apache/jsp/instance_005fconstants_jsp.

BDA Commissioner T. Shyam Bhatt told The Hindu that 119 acres of land was left out initially due to a clerical error during the compilation of data on land to be deleted. The BDA board meeting of March 4, 2013 that approved deletion.

“Rather, a compilation of multiple events of assumed risk at various levels” led to the final assessment that it was “pilot error.” The Prowler crashed at approximately 8:45 a.m. in a rural area while conducting routine training approximately.

Error While Moving Files Lightroom Nov 5, 2012. When you move your files while you are not in Lightroom, turn off one of your hard drives so that your computer can't see it anymore, or rename. Click Move in the confirmation dialog and Lightroom will move the photos. While these. Reconnecting folders and photos in Lightroom. When I move the

Compilation error with Grails 2. Error Fatal error during compilation org.apache.tools.ant. Fatal error during compilation org.apache.tools.ant.

In my maven build, I get the below error Fatal error during compilation org.apache.tools.ant.BuildException: java.lang.NoClassDefFoundError: org/springframework.

Could not find the main class: org.apache.tools.ant.launch.Launcher. So gave that path as ANT_HOME, now it is proceeding with compile.

`Error Fatal error during compilation org.apache.tools.ant.BuildException: Compilation Failed. Error Fatal error during compilation org.apache.tools.ant.

Nov 13, 2013  · Tools; Spring Tool Suite. How to increase memory with Grails Compile in STS/GGTS. Error Fatal error during compilation org.apache.tools.ant.BuildException:.

Oct 16, 2016. AWS Usage Tool. Contribute to ice development by creating an account on GitHub.

A fourth person in the vehicle was critically injured. Police in Bethel Park, in suburban Pittsburgh, have been examining.

New York – It is the first fatal police-involved shooting captured on body cameras. Richards didn’t speak at all during the encounter leading up to his death. A man from the building called one of Richards friends and put him on speaker. The friend.

In a hilarious compilation of clips on YouTube, a series of puppies bite, hop on and swipe at the metal springs, barking.

RECOMMENDED: Click here to fix Windows errors and improve system performance